Target
Urokinase-type plasminogen activator
Ligand
BDBM16173
Substrate
Meas. Tech.
ChEMBL_213305 (CHEMBL873883)
IC50
7000±n/a nM
Citation
 Hajduk, PJBoyd, SNettesheim, DNienaber, VSeverin, JSmith, RDavidson, DRockway, TFesik, SW Identification of novel inhibitors of urokinase via NMR-based screening. J Med Chem 43:3862-6 (2000)  
Target
Name:
Urokinase-type plasminogen activator
Synonyms:
3.4.21.73 U-plasminogen activator Urokinase Urokinase-type plasminogen activator chain B Urokinase-type plasminogen activator short chain A uPA
Type:
Enzyme
Mol. Mass.:
48528.62
Organism:
Homo sapiens (Human)
Description:
P00749
Residue:
431
  
Inhibitor
Name:
BDBM16173
Synonyms:
3,5-diamino-6-chloro-N-(diaminomethylene)pyrazinamide;hydrochloride Amiloride CHEMBL945
Type:
Small organic molecule
Emp. Form.:
C6H8ClN7O
Mol. Mass.:
229.627
SMILES:
NC(=N)NC(=O)c1nc(Cl)c(N)nc1N
: