Target
Potassium voltage-gated channel subfamily H member 2
Ligand
BDBM50063995
Substrate
Meas. Tech.
ChEMBL_1935999 (CHEMBL4481758)
IC50
1600±n/a nM
Citation
 Sutherland, HSTong, ASTChoi, PJBlaser, AConole, DFranzblau, SGLotlikar, MUCooper, CBUpton, AMDenny, WAPalmer, BD 3,5-Dialkoxypyridine analogues of bedaquiline are potent antituberculosis agents with minimal inhibition of the hERG channel. Bioorg Med Chem 27:1292-1307 (2019)  
Target
Name:
Potassium voltage-gated channel subfamily H member 2
Synonyms:
1,3-beta-glucan synthase component GLS2 ERG Eag-related protein 1 Ether-a-go-go-related gene (HERG) Ether-a-go-go-related gene potassium channel 1 Ether-a-go-go-related gene potassium channel 1 (hERG1) Ether-a-go-go-related protein 1 H-ERG KCNH2 Potassium voltage-gated channel subfamily H member 2 (hERG) Voltage-gated potassium channel subunit Kv11.1 hERG Potassium Channel 1 | putative potassium channel subunit
Type:
Multi-pass membrane protein
Mol. Mass.:
126672.65
Organism:
Homo sapiens (Human)
Description:
Q12809
Residue:
1159
  
Inhibitor
Name:
BDBM50063995
Synonyms:
Bedaquiline TMC207
Type:
Small organic molecule
Emp. Form.:
C32H31BrN2O2
Mol. Mass.:
555.505
SMILES:
COc1nc2ccc(Br)cc2cc1[C@@H](c1ccccc1)[C@@](O)(CCN(C)C)c1cccc2ccccc12
: