Target
B2 bradykinin receptor
Ligand
BDBM50093760
Substrate
Meas. Tech.
ChEBML_40297
Kd
14000±n/a nM
Citation
 Artis, DRBrotherton-Pleiss, CPease, JHLin, CJFerla, SWNewman, SRBhakta, SOstrelich, HJarnagin, K Structure-based design of six novel classes of nonpeptide antagonists of the bradykinin B2 receptor. Bioorg Med Chem Lett 10:2421-5 (2001)  
Target
Name:
B2 bradykinin receptor
Synonyms:
B2 BRADYKININ B2R BK-2 receptor BKRB2_HUMAN | Bradykinin B2 receptor
Type:
Enzyme Catalytic Domain
Mol. Mass.:
44467.17
Organism:
Homo sapiens (Human)
Description:
B2 BRADYKININ BDKRB2 HUMAN::P30411
Residue:
391
  
Inhibitor
Name:
BDBM50093760
Synonyms:
4-Aminomethyl-N-(3-amino-propyl)-N-(2,2-dibutyl-benzo[1,3]dioxol-4-yl)-benzamide | CHEMBL82600
Type:
Small organic molecule
Emp. Form.:
C26H37N3O3
Mol. Mass.:
439.5903
SMILES:
CCCCC1(CCCC)Oc2cccc(N(CCCN)C(=O)c3ccc(CN)cc3)c2O1
: