Target
B2 bradykinin receptor
Ligand
BDBM50093771
Substrate
Meas. Tech.
ChEBML_40297
Kd
5000±n/a nM
Citation
 Artis, DRBrotherton-Pleiss, CPease, JHLin, CJFerla, SWNewman, SRBhakta, SOstrelich, HJarnagin, K Structure-based design of six novel classes of nonpeptide antagonists of the bradykinin B2 receptor. Bioorg Med Chem Lett 10:2421-5 (2001)  
Target
Name:
B2 bradykinin receptor
Synonyms:
B2 BRADYKININ B2R BK-2 receptor BKRB2_HUMAN | Bradykinin B2 receptor
Type:
Enzyme Catalytic Domain
Mol. Mass.:
44467.17
Organism:
Homo sapiens (Human)
Description:
B2 BRADYKININ BDKRB2 HUMAN::P30411
Residue:
391
  
Inhibitor
Name:
BDBM50093771
Synonyms:
CHEMBL79057 | N-[(S)-1-(4-Butyl-pyridin-2-yl)-2-cyclohexyl-ethyl]-4-guanidinomethyl-benzamide
Type:
Small organic molecule
Emp. Form.:
C26H37N5O
Mol. Mass.:
435.6049
SMILES:
CCCCc1ccnc(c1)[C@H](CC1CCCCC1)NC(=O)c1ccc(CNC(N)=N)cc1
: