Target
11-beta-hydroxysteroid dehydrogenase 1
Ligand
BDBM50537917
Substrate
Meas. Tech.
ChEMBL_1970845 (CHEMBL4603663)
IC50
3.7±n/a nM
Citation
 Lee, JHBok, JHPark, SBPagire, HSNa, YJRim, EJung, WHSong, JSKang, NSSeo, HWJung, KYLee, BHKim, KYAhn, JH Optimization of cyclic sulfamide derivatives as 11?-hydroxysteroid dehydrogenase 1 inhibitors for the potential treatment of ischemic brain injury. Bioorg Med Chem Lett 30:0 (2020)  
Target
Name:
11-beta-hydroxysteroid dehydrogenase 1
Synonyms:
11-DH 11-beta-Hydroxysteroid Dehydrogenase 1 (11-beta-HSD1) 11beta-HSD1A Corticosteroid 11-beta-dehydrogenase isozyme 1 (11-beta-HSD-1) Hsd11 | Hsd11b1
Type:
Enzyme
Mol. Mass.:
32369.70
Organism:
Mus musculus (mouse)
Description:
P50172
Residue:
292
  
Inhibitor
Name:
BDBM50537917
Synonyms:
CHEMBL4648389
Type:
Small organic molecule
Emp. Form.:
C24H32Cl2N4O4S
Mol. Mass.:
543.506
SMILES:
CC1CN(CC(=O)NC2C3CC4CC2CC(C4)(C3)C(N)=O)S(=O)(=O)N(C1)c1c(Cl)cc(C)cc1Cl
: