Target
11-beta-hydroxysteroid dehydrogenase 1
Ligand
BDBM50247012
Substrate
Meas. Tech.
ChEMBL_1970845 (CHEMBL4603663)
IC50
243±n/a nM
Citation
 Lee, JHBok, JHPark, SBPagire, HSNa, YJRim, EJung, WHSong, JSKang, NSSeo, HWJung, KYLee, BHKim, KYAhn, JH Optimization of cyclic sulfamide derivatives as 11?-hydroxysteroid dehydrogenase 1 inhibitors for the potential treatment of ischemic brain injury. Bioorg Med Chem Lett 30:0 (2020)  
Target
Name:
11-beta-hydroxysteroid dehydrogenase 1
Synonyms:
11-DH 11-beta-Hydroxysteroid Dehydrogenase 1 (11-beta-HSD1) 11beta-HSD1A Corticosteroid 11-beta-dehydrogenase isozyme 1 (11-beta-HSD-1) Hsd11 | Hsd11b1
Type:
Enzyme
Mol. Mass.:
32369.70
Organism:
Mus musculus (mouse)
Description:
P50172
Residue:
292
  
Inhibitor
Name:
BDBM50247012
Synonyms:
3beta-O-Succinyl-18-beta-glycyrrhetinic acid US11660306, Example Carbeanoxolone
Type:
Small organic molecule
Emp. Form.:
C34H50O7
Mol. Mass.:
570.7566
SMILES:
CC1(C)[C@H](CC[C@@]2(C)[C@H]1CC[C@]1(C)[C@@H]2C(=O)C=C2[C@@H]3C[C@](C)(CC[C@]3(C)CC[C@@]12C)C(O)=O)OC(=O)CCC(O)=O
: