Target
Fatty acid-binding protein, adipocyte
Ligand
BDBM50538224
Substrate
Meas. Tech.
ChEMBL_1972438 (CHEMBL4605256)
Ki
164±n/a nM
Citation
 Su, HZou, YChen, GDou, HXie, HYuan, XZhang, XZhang, NLi, MXu, Y Exploration of Fragment Binding Poses Leading to Efficient Discovery of Highly Potent and Orally Effective Inhibitors of FABP4 for Anti-inflammation. J Med Chem 63:4090-4106 (2020)  
Target
Name:
Fatty acid-binding protein, adipocyte
Synonyms:
A-FABP ALBP FABP4 Fatty acid binding protein adipocyte Fatty acid-binding protein 4 (FABP4)
Type:
Enzyme
Mol. Mass.:
14719.23
Organism:
Homo sapiens (Human)
Description:
P15090
Residue:
132
  
Inhibitor
Name:
BDBM50538224
Synonyms:
CHEMBL4646688
Type:
Small organic molecule
Emp. Form.:
C20H14F3NO2
Mol. Mass.:
357.3259
SMILES:
OC(=O)c1ccccc1Nc1cccc(c1-c1ccccc1)C(F)(F)F
: