Target
Ephrin type-A receptor 2
Ligand
BDBM50538240
Substrate
Meas. Tech.
ChEMBL_1972489 (CHEMBL4605307)
Ki
115±n/a nM
Citation
 Mudd, GEBrown, AChen, Lvan Rietschoten, KWatcham, STeufel, DPPavan, SLani, RHuxley, PBennett, GS Identification and Optimization of EphA2-Selective Bicycles for the Delivery of Cytotoxic Payloads. J Med Chem 63:4107-4116 (2020)  
Target
Name:
Ephrin type-A receptor 2
Synonyms:
ECK EPHA2_HUMAN Epithelial cell kinase | Tyrosine-protein kinase receptor ECK
Type:
PROTEIN
Mol. Mass.:
108260.70
Organism:
Homo sapiens (Human)
Description:
ChEMBL_1505248
Residue:
976
  
Inhibitor
Name:
BDBM50538240
Synonyms:
CHEMBL4641388
Type:
Small organic molecule
Emp. Form.:
C90H142N24O23S3
Mol. Mass.:
2024.432
SMILES:
[H][C@@]12CCCN1C(=O)[C@H](CSCCC(=O)N1CN3CN(C1)C(=O)CCSC[C@]([H])(NC(=O)[C@H](CC(C)C)NC(=O)[C@@H]1CCCN1C(=O)[C@H](CC(N)=O)NC(=O)[C@@H](NC(=O)[C@H](CC(C)C)NC2=O)C(C)C)C(=O)N[C@@H](CC(C)C)C(=O)N[C@@H]([C@@H](C)O)C(=O)N[C@@H](CO)C(=O)NCC(=O)N[C@@H](Cc1c[nH]c2ccccc12)C(=O)N[C@@H](CCCCN)C(=O)N[C@@H](CSCCC3=O)C(=O)N[C@@H](C)C(N)=O)NC(=O)[C@H](C)N
: