Target
Ephrin type-A receptor 2
Ligand
BDBM50538243
Substrate
Meas. Tech.
ChEMBL_1972489 (CHEMBL4605307)
Ki
2618±n/a nM
Citation
 Mudd, GEBrown, AChen, Lvan Rietschoten, KWatcham, STeufel, DPPavan, SLani, RHuxley, PBennett, GS Identification and Optimization of EphA2-Selective Bicycles for the Delivery of Cytotoxic Payloads. J Med Chem 63:4107-4116 (2020)  
Target
Name:
Ephrin type-A receptor 2
Synonyms:
ECK EPHA2_HUMAN Epithelial cell kinase | Tyrosine-protein kinase receptor ECK
Type:
PROTEIN
Mol. Mass.:
108260.70
Organism:
Homo sapiens (Human)
Description:
ChEMBL_1505248
Residue:
976
  
Inhibitor
Name:
BDBM50538243
Synonyms:
CHEMBL4637447
Type:
Small organic molecule
Emp. Form.:
C75H106N20O21S3
Mol. Mass.:
1719.961
SMILES:
[H][C@@]12CSCCC(=O)N3CN(CN(C3)C(=O)CCSC[C@H](NC(=O)[C@H](C)N)C(=O)N[C@@H](CCCCN)C(=O)N3CCC[C@H]3C(=O)N1)C(=O)CCSC[C@H](NC(=O)[C@@H]1CCCN1C(=O)[C@H](Cc1c[nH]c3ccccc13)NC(=O)[C@H](C)NC(=O)[C@H](CO)NC(=O)[C@H](Cc1ccc(O)cc1)NC(=O)CNC(=O)[C@H](CC(O)=O)NC2=O)C(=O)N[C@@H](C)C(N)=O
: