Target
Ephrin type-A receptor 2
Ligand
BDBM50538244
Substrate
Meas. Tech.
ChEMBL_1972489 (CHEMBL4605307)
Ki
160±n/a nM
Citation
 Mudd, GEBrown, AChen, Lvan Rietschoten, KWatcham, STeufel, DPPavan, SLani, RHuxley, PBennett, GS Identification and Optimization of EphA2-Selective Bicycles for the Delivery of Cytotoxic Payloads. J Med Chem 63:4107-4116 (2020)  
Target
Name:
Ephrin type-A receptor 2
Synonyms:
ECK EPHA2_HUMAN Epithelial cell kinase | Tyrosine-protein kinase receptor ECK
Type:
PROTEIN
Mol. Mass.:
108260.70
Organism:
Homo sapiens (Human)
Description:
ChEMBL_1505248
Residue:
976
  
Inhibitor
Name:
BDBM50538244
Synonyms:
CHEMBL4638181
Type:
Small organic molecule
Emp. Form.:
C95H133N23O27S3
Mol. Mass.:
2125.405
SMILES:
[H][C@@]12CCCN1C(=O)[C@H](Cc1ccc(O)cc1)NC(=O)[C@H](C)NC(=O)[C@]1([H])CSCCC(=O)N3CN(CN(C3)C(=O)CCSC[C@H](NC(=O)[C@H](C)N)C(=O)N3CCC[C@@]3([H])C(=O)N[C@@H](CC(O)=O)C(=O)N[C@@H](Cc3c[nH]c4ccccc34)C(=O)NCC(=O)N[C@@H](CCCCN)C(=O)N[C@@H](Cc3ccc(O)cc3)C(=O)N1)C(=O)CCSC[C@H](NC(=O)[C@@]([H])(NC(=O)[C@@]([H])(NC(=O)[C@H](CC(O)=O)NC2=O)[C@@H](C)O)[C@@H](C)CC)C(=O)N[C@@H](C)C(N)=O
: