Target
Ephrin type-A receptor 2
Ligand
BDBM50538246
Substrate
Meas. Tech.
ChEMBL_1972489 (CHEMBL4605307)
Ki
223±n/a nM
Citation
 Mudd, GEBrown, AChen, Lvan Rietschoten, KWatcham, STeufel, DPPavan, SLani, RHuxley, PBennett, GS Identification and Optimization of EphA2-Selective Bicycles for the Delivery of Cytotoxic Payloads. J Med Chem 63:4107-4116 (2020)  
Target
Name:
Ephrin type-A receptor 2
Synonyms:
ECK EPHA2_HUMAN Epithelial cell kinase | Tyrosine-protein kinase receptor ECK
Type:
PROTEIN
Mol. Mass.:
108260.70
Organism:
Homo sapiens (Human)
Description:
ChEMBL_1505248
Residue:
976
  
Inhibitor
Name:
BDBM50538246
Synonyms:
CHEMBL4645245
Type:
Small organic molecule
Emp. Form.:
C70H113N21O22S3
Mol. Mass.:
1696.969
SMILES:
[H][C@]12CSCCC(=O)N3CN(CN(C3)C(=O)CCSC[C@H](NC(=O)[C@H](CC(C)C)NC(=O)[C@H](CC(N)=O)NC(=O)[C@H](CCC(N)=O)NC(=O)[C@@H](NC(=O)[C@H](C)NC1=O)C(C)C)C(=O)N[C@@H](C)C(N)=O)C(=O)CCSC[C@H](NC(=O)[C@H](C)N)C(=O)N[C@@H](CO)C(=O)N1CCC[C@H]1C(=O)N[C@@]([H])([C@@H](C)O)C(=O)N1CCC[C@H]1C(=O)N[C@@H](C)C(=O)N2
: