Target
Ephrin type-A receptor 2
Ligand
BDBM50538249
Substrate
Meas. Tech.
ChEMBL_1972489 (CHEMBL4605307)
Ki
268±n/a nM
Citation
 Mudd, GEBrown, AChen, Lvan Rietschoten, KWatcham, STeufel, DPPavan, SLani, RHuxley, PBennett, GS Identification and Optimization of EphA2-Selective Bicycles for the Delivery of Cytotoxic Payloads. J Med Chem 63:4107-4116 (2020)  
Target
Name:
Ephrin type-A receptor 2
Synonyms:
ECK EPHA2_HUMAN Epithelial cell kinase | Tyrosine-protein kinase receptor ECK
Type:
PROTEIN
Mol. Mass.:
108260.70
Organism:
Homo sapiens (Human)
Description:
ChEMBL_1505248
Residue:
976
  
Inhibitor
Name:
BDBM50538249
Synonyms:
CHEMBL4648501
Type:
Small organic molecule
Emp. Form.:
C77H98N18O19S3
Mol. Mass.:
1675.906
SMILES:
[H][C@]12CSCc3cc(CSC[C@H](NC(=O)[C@H](CC(O)=O)NC(=O)[C@H](Cc4ccc(O)cc4)NC(=O)[C@@H](NC(=O)[C@H](Cc4c[nH]c5ccccc45)NC(=O)[C@H](C)NC(=O)[C@H](CO)NC(=O)[C@H](Cc4c[nH]c5ccccc45)NC1=O)C(C)C)C(=O)N[C@@H](C)C(N)=O)cc(CSC[C@H](NC(=O)[C@H](C)N)C(=O)NCC(=O)N[C@@H](CCC(N)=O)C(=O)N2)c3
: