Target
Ephrin type-A receptor 2
Ligand
BDBM50538251
Substrate
Meas. Tech.
ChEMBL_1972489 (CHEMBL4605307)
Ki
83±n/a nM
Citation
 Mudd, GEBrown, AChen, Lvan Rietschoten, KWatcham, STeufel, DPPavan, SLani, RHuxley, PBennett, GS Identification and Optimization of EphA2-Selective Bicycles for the Delivery of Cytotoxic Payloads. J Med Chem 63:4107-4116 (2020)  
Target
Name:
Ephrin type-A receptor 2
Synonyms:
ECK EPHA2_HUMAN Epithelial cell kinase | Tyrosine-protein kinase receptor ECK
Type:
PROTEIN
Mol. Mass.:
108260.70
Organism:
Homo sapiens (Human)
Description:
ChEMBL_1505248
Residue:
976
  
Inhibitor
Name:
BDBM50538251
Synonyms:
CHEMBL4645672
Type:
Small organic molecule
Emp. Form.:
C91H129N21O21S3
Mol. Mass.:
1949.321
SMILES:
[H][C@@]12CCCN1C(=O)N[C@@H](CCC(O)=O)C(=O)[C@H](Cc1ccccc1)NC(=O)[C@H](CCC(N)=O)NC(=O)[C@H](CC(C)C)NC(=O)[C@H](C)NC(=O)[C@]1([H])CSCc3cc(CSC[C@H](NC2=O)C(=O)N[C@@H](C)C(N)=O)cc(CSC[C@H](NC(=O)[C@H](C)N)C(=O)N[C@@H](C(C)C)C(=O)N2CCC[C@@]2([H])C(=O)N[C@@H](CCC(N)=O)C(=O)NCC(=O)N[C@@]([H])([C@@H](C)CC)C(=O)N[C@@H](Cc2c[nH]c4ccccc24)C(=O)N1)c3
: