Target
Ephrin type-A receptor 2
Ligand
BDBM50538252
Substrate
Meas. Tech.
ChEMBL_1972489 (CHEMBL4605307)
Ki
0.540000±n/a nM
Citation
 Mudd, GEBrown, AChen, Lvan Rietschoten, KWatcham, STeufel, DPPavan, SLani, RHuxley, PBennett, GS Identification and Optimization of EphA2-Selective Bicycles for the Delivery of Cytotoxic Payloads. J Med Chem 63:4107-4116 (2020)  
Target
Name:
Ephrin type-A receptor 2
Synonyms:
ECK EPHA2_HUMAN Epithelial cell kinase | Tyrosine-protein kinase receptor ECK
Type:
PROTEIN
Mol. Mass.:
108260.70
Organism:
Homo sapiens (Human)
Description:
ChEMBL_1505248
Residue:
976
  
Inhibitor
Name:
BDBM50538252
Synonyms:
CHEMBL4642167
Type:
Small organic molecule
Emp. Form.:
C114H152N30O24S3
Mol. Mass.:
2422.808
SMILES:
[H][C@@]12CCCN1C(=O)[C@H](CCCNC(N)=N)NC(=O)[C@H](CC(N)=O)NC(=O)[C@@H](NC(=O)[C@]1([H])CCCN1C(=O)[C@]1([H])CSCc3cc(CSC[C@H](NC(=O)CNC2=O)C(=O)N[C@@H](C)C(N)=O)cc(CSC[C@H](NC(=O)C2CCCN2C(=O)[C@@H](NC(=O)[C@H](CC(O)=O)NC(=O)[C@H](Cc2c[nH]cn2)NC(=O)[C@H](C)N)C(C)C)C(=O)N2CCC[C@@]2([H])C(=O)N[C@@H](Cc2c[nH]c4ccccc24)C(=O)NCC(=O)N2CCC[C@@]2([H])C(=O)N[C@@H](Cc2ccccc2)C(=O)N[C@@H](Cc2c[nH]c4ccccc24)C(=O)N1)c3)C(C)C
: