Target
Ephrin type-A receptor 2
Ligand
BDBM50538254
Substrate
Meas. Tech.
ChEMBL_1972489 (CHEMBL4605307)
Ki
27±n/a nM
Citation
 Mudd, GEBrown, AChen, Lvan Rietschoten, KWatcham, STeufel, DPPavan, SLani, RHuxley, PBennett, GS Identification and Optimization of EphA2-Selective Bicycles for the Delivery of Cytotoxic Payloads. J Med Chem 63:4107-4116 (2020)  
Target
Name:
Ephrin type-A receptor 2
Synonyms:
ECK EPHA2_HUMAN Epithelial cell kinase | Tyrosine-protein kinase receptor ECK
Type:
PROTEIN
Mol. Mass.:
108260.70
Organism:
Homo sapiens (Human)
Description:
ChEMBL_1505248
Residue:
976
  
Inhibitor
Name:
BDBM50538254
Synonyms:
CHEMBL4638336
Type:
Small organic molecule
Emp. Form.:
C98H128N22O22S3
Mol. Mass.:
2062.394
SMILES:
[H][C@@]12CCCN1C(=O)CNC(=O)[C@H](Cc1ccccc1)NC(=O)[C@]1([H])CCCN1C(=O)[C@]1([H])CSCc3cc(CSC[C@H](NC(=O)[C@H](Cc4c[nH]c5ccccc45)NC(=O)[C@H](Cc4ccc(O)cc4)NC2=O)C(=O)N[C@@H](C)C(N)=O)cc(CSC[C@H](NC(=O)[C@H](C)N)C(=O)N[C@@H](CCCNC(N)=N)C(=O)N[C@@H](C(C)C)C(=O)N[C@@H](CO)C(=O)N2CCC[C@@]2([H])C(=O)N[C@@H](CCC(O)=O)C(=O)N[C@@H](Cc2ccc(O)cc2)C(=O)N1)c3
: