Target
Ephrin type-A receptor 2
Ligand
BDBM50538257
Substrate
Meas. Tech.
ChEMBL_1972489 (CHEMBL4605307)
Ki
101±n/a nM
Citation
 Mudd, GEBrown, AChen, Lvan Rietschoten, KWatcham, STeufel, DPPavan, SLani, RHuxley, PBennett, GS Identification and Optimization of EphA2-Selective Bicycles for the Delivery of Cytotoxic Payloads. J Med Chem 63:4107-4116 (2020)  
Target
Name:
Ephrin type-A receptor 2
Synonyms:
ECK EPHA2_HUMAN Epithelial cell kinase | Tyrosine-protein kinase receptor ECK
Type:
PROTEIN
Mol. Mass.:
108260.70
Organism:
Homo sapiens (Human)
Description:
ChEMBL_1505248
Residue:
976
  
Inhibitor
Name:
BDBM50538257
Synonyms:
CHEMBL4647046
Type:
Small organic molecule
Emp. Form.:
C80H111N19O20S4
Mol. Mass.:
1787.113
SMILES:
[H][C@]12CSCc3cc(CSC[C@H](NC(=O)[C@@]([H])(NC(=O)[C@H](Cc4c[nH]c5ccccc45)NC(=O)CNC(=O)[C@H](CC(C)C)NC(=O)[C@H](CO)NC1=O)[C@@H](C)O)C(=O)N[C@@H](C)C(N)=O)cc(CSC[C@H](NC(=O)[C@H](C)N)C(=O)N[C@@H](CCSC)C(=O)N[C@@H](CC(N)=O)C(=O)N[C@@H](CC(O)=O)C(=O)N[C@@H](Cc1c[nH]c4ccccc14)C(=O)N[C@@H](CC(C)C)C(=O)N2)c3
: