Target
Ephrin type-A receptor 2
Ligand
BDBM50538258
Substrate
Meas. Tech.
ChEMBL_1972489 (CHEMBL4605307)
Ki
2.0±n/a nM
Citation
 Mudd, GEBrown, AChen, Lvan Rietschoten, KWatcham, STeufel, DPPavan, SLani, RHuxley, PBennett, GS Identification and Optimization of EphA2-Selective Bicycles for the Delivery of Cytotoxic Payloads. J Med Chem 63:4107-4116 (2020)  
Target
Name:
Ephrin type-A receptor 2
Synonyms:
ECK EPHA2_HUMAN Epithelial cell kinase | Tyrosine-protein kinase receptor ECK
Type:
PROTEIN
Mol. Mass.:
108260.70
Organism:
Homo sapiens (Human)
Description:
ChEMBL_1505248
Residue:
976
  
Inhibitor
Name:
BDBM50538258
Synonyms:
CHEMBL4641389
Type:
Small organic molecule
Emp. Form.:
C108H167N33O28S3
Mol. Mass.:
2471.881
SMILES:
[H][C@@]12CCCN1C(=O)[C@H](CC(N)=O)NC(=O)[C@@H](NC(=O)[C@H](CC(C)C)NC(=O)[C@]1([H])C[C@H](O)CN1C(=O)[C@H](CSCCC(=O)N1CN3CN(C1)C(=O)CCSC[C@]([H])(NC(=O)[C@H](CC(C)C)NC2=O)C(=O)N[C@@H](CC(C)C)C(=O)N[C@@H](Cc1c[nH]cn1)C(=O)N1CCC[C@@]1([H])C(=O)N[C@H](CC(O)=O)C(=O)N[C@@H](Cc1c[nH]c2ccccc12)C(=O)N[C@@H](CCCCNC(N)=N)C(=O)N[C@@H](CSCCC3=O)C(=O)N[C@@H](C)C(N)=O)NC(=O)[C@H](CC(O)=O)NC(=O)[C@H](CCCCNC(N)=N)NC(=O)[C@H](C)N)C(C)C
: