Target
Ephrin type-A receptor 2
Ligand
BDBM50538268
Substrate
Meas. Tech.
ChEMBL_1972489 (CHEMBL4605307)
Ki
35±n/a nM
Citation
 Mudd, GEBrown, AChen, Lvan Rietschoten, KWatcham, STeufel, DPPavan, SLani, RHuxley, PBennett, GS Identification and Optimization of EphA2-Selective Bicycles for the Delivery of Cytotoxic Payloads. J Med Chem 63:4107-4116 (2020)  
Target
Name:
Ephrin type-A receptor 2
Synonyms:
ECK EPHA2_HUMAN Epithelial cell kinase | Tyrosine-protein kinase receptor ECK
Type:
PROTEIN
Mol. Mass.:
108260.70
Organism:
Homo sapiens (Human)
Description:
ChEMBL_1505248
Residue:
976
  
Inhibitor
Name:
BDBM50538268
Synonyms:
CHEMBL4642586
Type:
Small organic molecule
Emp. Form.:
C103H156N30O26S3
Mol. Mass.:
2326.721
SMILES:
[H][C@@]12CCCN1C(=O)[C@H](Cc1c[nH]cn1)NC(=O)[C@H](CC(C)C)NC(=O)[C@@H]1CSCCC(=O)N3CN(CN(C3)C(=O)CCSC[C@H](NC(=O)[C@H](CC(O)=O)NC(=O)[C@H](CCCNC(N)=N)NC(=O)[C@H](C)N)C(=O)N3CCC[C@H]3C(=O)N[C@@H](C3CCCC3)C(=O)N[C@@H](C(C)C)C(=O)N[C@@H](CC(N)=O)C(=O)N3CCC[C@@]3([H])C(=O)N[C@@H](CC(C)C)C(=O)N1)C(=O)CCSC[C@H](NC(=O)[C@@]([H])(NC(=O)[C@H](Cc1c[nH]c3ccccc13)NC(=O)CNC2=O)[C@@H](C)O)C(=O)N[C@@H](C)C(N)=O
: