Target
Ephrin type-A receptor 2
Ligand
BDBM50538273
Substrate
Meas. Tech.
ChEMBL_1972489 (CHEMBL4605307)
Ki
3.1±n/a nM
Citation
 Mudd, GEBrown, AChen, Lvan Rietschoten, KWatcham, STeufel, DPPavan, SLani, RHuxley, PBennett, GS Identification and Optimization of EphA2-Selective Bicycles for the Delivery of Cytotoxic Payloads. J Med Chem 63:4107-4116 (2020)  
Target
Name:
Ephrin type-A receptor 2
Synonyms:
ECK EPHA2_HUMAN Epithelial cell kinase | Tyrosine-protein kinase receptor ECK
Type:
PROTEIN
Mol. Mass.:
108260.70
Organism:
Homo sapiens (Human)
Description:
ChEMBL_1505248
Residue:
976
  
Inhibitor
Name:
BDBM50538273
Synonyms:
CHEMBL4634551
Type:
Small organic molecule
Emp. Form.:
C177H270ClN45O48S5
Mol. Mass.:
3992.088
SMILES:
[H][C@]12O[C@]1(C)[C@@H](CC(=O)N(C)c1cc(C\C(C)=C\C=C\[C@H](OC)[C@]3(O)C[C@@]([H])(OC(=O)N3)[C@@H]2C)cc(OC)c1Cl)OC(=O)[C@@H](C)N(C)C(=O)CCSSCCCC(=O)NCCC(=O)N(C)C(=O)CN(C)C(=O)CN(C)C(=O)CN(C)C(=O)CN(C)C(=O)CN(C)C(=O)CN(C)CC(=O)N(C)CC(=O)N(C)CC(=O)N(C)CC(=O)N[C@@H](C)C(=O)N[C@@H](CCCNC(N)=N)C(=O)N[C@@H](CC(O)=O)C(=O)N[C@H]1CSCCC(=O)N2CN3CN(C2)C(=O)CCSC[C@]([H])(NC(=O)[C@H](CC(C)C)NC(=O)[C@]2([H])CCCN2C(=O)[C@H](CC(N)=O)NC(=O)[C@@H](NC(=O)[C@H](CC(C)C)NC(=O)[C@]2([H])CCCN2C1=O)C(C)C)C(=O)N[C@@H](CC(C)C)C(=O)N[C@@H](Cc1c[nH]cn1)C(=O)N1CCC[C@@]1([H])C(=O)N[C@H](CC(O)=O)C(=O)N[C@@H](CC1CCc2ccccc12)C(=O)NC(CCCCNC(N)=N)C(=O)N[C@@H](CSCCC3=O)C(N)=O
: