Target
Steroid 17-alpha-hydroxylase/17,20 lyase
Ligand
BDBM50358201
Substrate
Meas. Tech.
ChEMBL_1972513 (CHEMBL4605331)
Kd
40±n/a nM
Citation
 Child, SAGuengerich, FP Multistep Binding of the Non-Steroidal Inhibitors Orteronel and Seviteronel to Human Cytochrome P450 17A1 and Relevance to Inhibition of Enzyme Activity. J Med Chem 63:6513-6522 (2020)  
Target
Name:
Steroid 17-alpha-hydroxylase/17,20 lyase
Synonyms:
CP17A_HUMAN CYP17A1 Cytochrome P450 17A1 Cytochrome P450 C17 (CYP17) Cytochrome P450-C17 P450-C17 Steroid 17-alpha-Monooxygenase (CYP17) Steroid 17-alpha-monooxygenase | cytochrome P450 monooxygenase 17 alpha hydroxylase/17,20-lyase (CYP17)
Type:
Enzyme
Mol. Mass.:
57382.42
Organism:
Homo sapiens (Human)
Description:
E.coli expressing human CYP17
Residue:
508
  
Inhibitor
Name:
BDBM50358201
Synonyms:
CHEMBL1921976 | US9611270, orteronel
Type:
Small organic molecule
Emp. Form.:
C18H17N3O2
Mol. Mass.:
307.3465
SMILES:
CNC(=O)c1ccc2cc(ccc2c1)[C@@]1(O)CCn2cncc12
: