Target
Tyrosine-protein kinase SYK
Ligand
BDBM212271
Substrate
Meas. Tech.
ChEMBL_1972858 (CHEMBL4605676)
EC50
24±n/a nM
Citation
 Blomgren, PChandrasekhar, JDi Paolo, JAFung, WGeng, GIp, CJones, RKropf, JELansdon, EBLee, SLo, JRMitchell, SAMurray, BPohlmeyer, CSchmitt, ASuekawa-Pirrone, KWise, SXiong, JMXu, JYu, HZhao, ZCurrie, KS Discovery of Lanraplenib (GS-9876): A Once-Daily Spleen Tyrosine Kinase Inhibitor for Autoimmune Diseases. ACS Med Chem Lett 11:506-513 (2020)  
Target
Name:
Tyrosine-protein kinase SYK
Synonyms:
KSYK_HUMAN Spleen Tyrosine Kinase Tyrosine-protein kinase SYK (Syk)
Type:
Enzyme
Mol. Mass.:
72079.99
Organism:
Homo sapiens (Human)
Description:
P43405
Residue:
635
  
Inhibitor
Name:
BDBM212271
Synonyms:
6-(6-aminopyrazin-2-yl)-N-(4-(4-(oxetan-3-yl)piperazin-1-yl)phenyl)imidazo[1,2-a]pyrazin-8-amine US10828299, Example Ex.-2 US9290505, Ex.-2 US9931338, Ex.-2
Type:
Small organic molecule
Emp. Form.:
C23H25N9O
Mol. Mass.:
443.5043
SMILES:
Nc1cncc(n1)-c1cn2ccnc2c(Nc2ccc(cc2)N2CCN(CC2)C2COC2)n1
: