Target
Ubiquitin carboxyl-terminal hydrolase 47
Ligand
BDBM50538552
Substrate
Meas. Tech.
ChEMBL_1973135 (CHEMBL4605953)
IC50
>40000±n/a nM
Citation
 Leger, PRHu, DXBiannic, BBui, MHan, XKarbarz, EMaung, JOkano, AOsipov, MShibuya, GMYoung, KHiggs, CAbraham, BBradford, DCho, CColas, CJacobson, SOhol, YMPookot, DRana, PSanchez, JShah, NSun, MWong, SBrockstedt, DGKassner, PDSchwarz, JBWustrow, DJ Discovery of Potent, Selective, and Orally Bioavailable Inhibitors of USP7 with In Vivo Antitumor Activity. J Med Chem 63:5398-5420 (2020)  
Target
Name:
Ubiquitin carboxyl-terminal hydrolase 47
Synonyms:
Deubiquitinating enzyme 47 USP47 Ubiquitin-specific-processing protease 47
Type:
PROTEIN
Mol. Mass.:
157255.08
Organism:
Homo sapiens (Human)
Description:
ChEMBL_855560
Residue:
1375
  
Inhibitor
Name:
BDBM50538552
Synonyms:
CHEMBL4636266
Type:
Small organic molecule
Emp. Form.:
C20H18ClN3O2S
Mol. Mass.:
399.894
SMILES:
Clc1cc2C[C@@H](Oc2c(c1)-c1ccnc2ccsc12)C(=O)N1CCNCC1
: