Target
Ubiquitin carboxyl-terminal hydrolase 47
Ligand
BDBM50538558
Substrate
Meas. Tech.
ChEMBL_1973135 (CHEMBL4605953)
IC50
>80000±n/a nM
Citation
 Leger, PRHu, DXBiannic, BBui, MHan, XKarbarz, EMaung, JOkano, AOsipov, MShibuya, GMYoung, KHiggs, CAbraham, BBradford, DCho, CColas, CJacobson, SOhol, YMPookot, DRana, PSanchez, JShah, NSun, MWong, SBrockstedt, DGKassner, PDSchwarz, JBWustrow, DJ Discovery of Potent, Selective, and Orally Bioavailable Inhibitors of USP7 with In Vivo Antitumor Activity. J Med Chem 63:5398-5420 (2020)  
Target
Name:
Ubiquitin carboxyl-terminal hydrolase 47
Synonyms:
Deubiquitinating enzyme 47 USP47 Ubiquitin-specific-processing protease 47
Type:
PROTEIN
Mol. Mass.:
157255.08
Organism:
Homo sapiens (Human)
Description:
ChEMBL_855560
Residue:
1375
  
Inhibitor
Name:
BDBM50538558
Synonyms:
CHEMBL4641488
Type:
Small organic molecule
Emp. Form.:
C23H23ClN4O3S
Mol. Mass.:
470.972
SMILES:
CC(=O)NCc1cc2nccc(-c3cc(Cl)cc4C[C@@H](Oc34)C(=O)N3CCNCC3)c2s1
: