Target
Cytochrome P450 3A4
Ligand
BDBM50538668
Substrate
Meas. Tech.
ChEMBL_1973673 (CHEMBL4606491)
EC50
50000±n/a nM
Citation
 Janetka, JWHopper, ATYang, ZBarks, JDhason, MSWang, QSibley, LD Optimizing Pyrazolopyrimidine Inhibitors of Calcium Dependent Protein Kinase 1 for Treatment of Acute and Chronic Toxoplasmosis. J Med Chem 63:6144-6163 (2020)  
Target
Name:
Cytochrome P450 3A4
Synonyms:
Albendazole monooxygenase CP3A4_HUMAN CYP3A4 CYPIIIA4 Cytochrome P450 3A4 (CYP3A4) Nifedipine oxidase Taurochenodeoxycholate 6-alpha-hydroxylase
Type:
Enzyme
Mol. Mass.:
57349.57
Organism:
Homo sapiens (Human)
Description:
Residue:
503
  
Inhibitor
Name:
BDBM50538668
Synonyms:
CHEMBL4634455 | US11518761, Example 159
Type:
Small organic molecule
Emp. Form.:
C14H11F3N6O
Mol. Mass.:
336.2719
SMILES:
Nc1ncnc2n(nc(Oc3cc(ccn3)C(F)(F)F)c12)C1CC1
: