Target
Lysophosphatidic acid receptor 2
Ligand
BDBM50148351
Substrate
Meas. Tech.
ChEMBL_1977565 (CHEMBL4610700)
EC50
1089±n/a nM
Target
Name:
Lysophosphatidic acid receptor 2
Synonyms:
EDG4 LPA-2 LPAR2 Lysophosphatidic acid receptor 2 | Lysophosphatidic acid receptor Edg-4
Type:
PROTEIN
Mol. Mass.:
39103.44
Organism:
Homo sapiens (Human)
Description:
ChEMBL_1451385
Residue:
351
  
Inhibitor
Name:
BDBM50148351
Synonyms:
CHEMBL117529 | [3-((Z)-Octadec-9-enoylamino)-propionyl]-phosphonic acid
Type:
Small organic molecule
Emp. Form.:
C21H40NO5P
Mol. Mass.:
417.5198
SMILES:
CCCCCCCC\C=C/CCCCCCCC(=O)NCCC(=O)P(O)(O)=O
: