Target
Bromodomain-containing protein 4
Ligand
BDBM50539093
Substrate
Meas. Tech.
ChEMBL_1977640 (CHEMBL4610775)
IC50
14±n/a nM
Citation
 Zhang, FWu, ZChen, PZhang, JWang, TZhou, JZhang, H Discovery of a new class of PROTAC BRD4 degraders based on a dihydroquinazolinone derivative and lenalidomide/pomalidomide. Bioorg Med Chem 28:0 (2020)  
Target
Name:
Bromodomain-containing protein 4
Synonyms:
BRD4 Bromodomain-containing protein 4 (BRD4) Protein HUNK1
Type:
Protein
Mol. Mass.:
152264.84
Organism:
Homo sapiens (Human)
Description:
O60885
Residue:
1362
  
Inhibitor
Name:
BDBM50539093
Synonyms:
CHEMBL4633500
Type:
Small organic molecule
Emp. Form.:
C40H39N9O7
Mol. Mass.:
757.7938
SMILES:
CN1C(=O)N(Cc2cn(CCOCC(=O)Nc3cccc4C(=O)N(Cc34)C3CCC(=O)NC3=O)nn2)C(c2ccccc2)c2cc(ccc12)-c1c(C)noc1C
: