Target
Cyclin-dependent kinase 12
Ligand
BDBM50110178
Substrate
Meas. Tech.
ChEMBL_1978730 (CHEMBL4611865)
IC50
893±n/a nM
Citation
 Diab, SYu, MWang, S CDK7 Inhibitors in Cancer Therapy: The Sweet Smell of Success? J Med Chem 63:7458-7474 (2020)  
Target
Name:
Cyclin-dependent kinase 12
Synonyms:
2.7.11.22 CDC2-related protein kinase 7 CDK12_HUMAN CRKRS Cell division cycle 2-related protein kinase 7 Cyclin-dependent kinase 12 hCDK12
Type:
PROTEIN
Mol. Mass.:
164218.64
Organism:
Homo sapiens
Description:
ChEMBL_117739
Residue:
1490
  
Inhibitor
Name:
BDBM50110178
Synonyms:
CHEMBL3603847 | US10787436, Compound I-23
Type:
Small organic molecule
Emp. Form.:
C31H28ClN7O2
Mol. Mass.:
566.053
SMILES:
CN(C)C\C=C\C(=O)Nc1ccc(cc1)C(=O)Nc1cccc(Nc2ncc(Cl)c(n2)-c2c[nH]c3ccccc23)c1
: