Target
Adenosine receptor A2b
Ligand
BDBM50095787
Substrate
Meas. Tech.
ChEMBL_30303 (CHEMBL639472)
IC50
72.0±n/a nM
Citation
 Harada, HAsano, OHoshino, YYoshikawa, SMatsukura, MKabasawa, YNiijima, JKotake, YWatanabe, NKawata, TInoue, THorizoe, TYasuda, NMinami, HNagata, KMurakami, MNagaoka, JKobayashi, STanaka, IAbe, S 2-Alkynyl-8-aryl-9-methyladenines as novel adenosine receptor antagonists: their synthesis and structure-activity relationships toward hepatic glucose production induced via agonism of the A(2B) receptor. J Med Chem 44:170-9 (2001)  
Target
Name:
Adenosine receptor A2b
Synonyms:
AA2BR_HUMAN ADORA2B Adenosine receptors A2b | Adenosine receptors; A2a & A2b
Type:
G Protein-Coupled Receptor (GPCR)
Mol. Mass.:
36341.22
Organism:
Homo sapiens (Human)
Description:
Residue:
332
  
Inhibitor
Name:
BDBM50095787
Synonyms:
3-[6-Amino-2-(1-hydroxy-cyclohexylethynyl)-9-methyl-9H-purin-8-yl]-benzonitrile | CHEMBL49925
Type:
Small organic molecule
Emp. Form.:
C21H20N6O
Mol. Mass.:
372.4231
SMILES:
Cn1c(nc2c(N)nc(nc12)C#CC1(O)CCCCC1)-c1cccc(c1)C#N
: