Target
Casein kinase II subunit alpha 3
Ligand
BDBM50335638
Substrate
Meas. Tech.
ChEMBL_1979300 (CHEMBL4612435)
IC50
1.8±n/a nM
Citation
 Rangasamy, LOrtín, IZapico, JMCoderch, CRamos, Ade Pascual-Teresa, B New Dual CK2/HDAC1 Inhibitors with Nanomolar Inhibitory Activity against Both Enzymes. ACS Med Chem Lett 11:713-719 (2020)  
Target
Name:
Casein kinase II subunit alpha 3
Synonyms:
2.7.11.1 CSK23_HUMAN CSNK2A3 Casein kinase II subunit alpha 3
Type:
PROTEIN
Mol. Mass.:
45229.76
Organism:
Homo sapiens
Description:
ChEMBL_116899
Residue:
391
  
Inhibitor
Name:
BDBM50335638
Synonyms:
5-(3-Chlorophenylamino)benzo[c][2,6]naphthyridine-8-carboxylic acid CHEMBL1230165 US9062043, Table 13, Compound 17 | US9062043, Table 20b, Compound 12
Type:
Small organic molecule
Emp. Form.:
C19H12ClN3O2
Mol. Mass.:
349.77
SMILES:
OC(=O)c1ccc2c(c1)nc(Nc1cccc(Cl)c1)c1ccncc21
: