Target
Sarcoplasmic/endoplasmic reticulum calcium ATPase 1
Ligand
BDBM50242014
Substrate
Meas. Tech.
ChEMBL_1979331 (CHEMBL4612466)
IC50
28650±n/a nM
Citation
 Heger, VBenesova, BViskupicova, JMajekova, MZoofishan, ZHunyadi, AHorakova, L Phenolic Compounds from  ACS Med Chem Lett 11:1006-1013 (2020)  
Target
Name:
Sarcoplasmic/endoplasmic reticulum calcium ATPase 1
Synonyms:
AT2A1_RAT Calcium pump 1 Endoplasmic reticulum class 1/2 Ca(2+) ATPase SR Ca(2+)-ATPase 1 | Sarcoplasmic/endoplasmic reticulum calcium ATPase 1
Type:
PROTEIN
Mol. Mass.:
109386.62
Organism:
Rattus norvegicus
Description:
ChEMBL_109814
Residue:
994
  
Inhibitor
Name:
BDBM50242014
Synonyms:
CHEMBL464006 Morusin, 3 cid_5281671
Type:
Small organic molecule
Emp. Form.:
C25H24O6
Mol. Mass.:
420.4545
SMILES:
[#6]\[#6](-[#6])=[#6]\[#6]-c1c(oc2c3-[#6]=[#6]C([#6])([#6])[#8]-c3cc(-[#8])c2c1=O)-c1ccc(-[#8])cc1-[#8]
: