Target
Voltage-dependent L-type calcium channel subunit alpha-1F
Ligand
BDBM50540100
Substrate
Meas. Tech.
ChEMBL_1980355 (CHEMBL4613617)
IC50
13000±n/a nM
Citation
 de Los Ríos, CMarco-Contelles, J Tacrines for Alzheimer's disease therapy. III. The PyridoTacrines. Eur J Med Chem 166:381-389 (2019)  
Target
Name:
Voltage-dependent L-type calcium channel subunit alpha-1F
Synonyms:
CAC1F_HUMAN CACNAF1 Voltage-gated calcium channel | Voltage-gated calcium channel subunit alpha Cav1.4
Type:
PROTEIN
Mol. Mass.:
220661.87
Organism:
Homo sapiens (Human)
Description:
ChEMBL_105734
Residue:
1977
  
Inhibitor
Name:
BDBM50540100
Synonyms:
CHEMBL4637869
Type:
Small organic molecule
Emp. Form.:
C23H24N4O4
Mol. Mass.:
420.4611
SMILES:
CCOC(=O)c1c(C)nc2nc3CCCCCc3c(N)c2c1-c1ccc(cc1)[N+]([O-])=O
: