Target
DNA topoisomerase I
Ligand
BDBM50410161
Substrate
Meas. Tech.
ChEMBL_1980356 (CHEMBL4613618)
IC50
307000±n/a nM
Citation
 Alsayari, AMuhsinah, ABHassan, MZAhsan, MJAlshehri, JABegum, N Aurone: A biologically attractive scaffold as anticancer agent. Eur J Med Chem 166:417-431 (2019)  
Target
Name:
DNA topoisomerase I
Synonyms:
5.6.2.1 DNA topoisomerase I | TOP1
Type:
PROTEIN
Mol. Mass.:
89735.02
Organism:
Bos taurus
Description:
ChEMBL_119672
Residue:
757
  
Inhibitor
Name:
BDBM50410161
Synonyms:
CHEMBL191804
Type:
Small organic molecule
Emp. Form.:
C15H10O2
Mol. Mass.:
222.2387
SMILES:
O=C1Oc2ccccc2\C1=C/c1ccccc1
: