Target
Sodium-dependent dopamine transporter
Ligand
BDBM50156055
Substrate
Meas. Tech.
ChEMBL_1980751 (CHEMBL4614013)
Ki
8160±n/a nM
Citation
 Slack, RDKu, TCCao, JGiancola, JBBonifazi, ALoland, CJGadiano, ALam, JRais, RSlusher, BSCoggiano, MTanda, GNewman, AH Structure-Activity Relationships for a Series of (Bis(4-fluorophenyl)methyl)sulfinyl Alkyl Alicyclic Amines at the Dopamine Transporter: Functionalizing the Terminal Nitrogen Affects Affinity, Selectivity, and Metabolic Stability. J Med Chem 63:2343-2357 (2020)  
Target
Name:
Sodium-dependent dopamine transporter
Synonyms:
DA transporter SC6A3_RAT Sodium-dependent dopamine transporter | Sodium-dependent dopamine transporter (DAT)
Type:
Multi-pass membrane protein
Mol. Mass.:
68749.45
Organism:
Rattus norvegicus (rat)
Description:
P23977
Residue:
619
  
Inhibitor
Name:
BDBM50156055
Synonyms:
2-(Diphenyl-methanesulfinyl)-acetamide 2-[(diphenylmethyl)sulfinyl]acetamide CEP-1538 CRL-40476 Provigil US11555013, Compound (+-)-modafinilb | US9862679, Compound (+-)-modafinil
Type:
Small organic molecule
Emp. Form.:
C15H15NO2S
Mol. Mass.:
273.35
SMILES:
NC(=O)CS(=O)C(c1ccccc1)c1ccccc1
: