Target
Beta-secretase 1
Ligand
BDBM50540168
Substrate
Meas. Tech.
ChEMBL_1980873 (CHEMBL4614135)
IC50
990±n/a nM
Citation
 Winneroski, LLErickson, JAGreen, SJLopez, JEStout, SLPorter, WJTimm, DEAudia, JEBarberis, MBeck, JPBoggs, LNBorders, ARBoyer, RDBrier, RAHembre, EJHendle, JGarcia-Losada, PMinguez, JMMathes, BMMay, PCMonk, SARankovic, ZShi, YWatson, BMYang, ZMergott, DJ Preparation and biological evaluation of BACE1 inhibitors: Leveraging trans-cyclopropyl moieties as ligand efficient conformational constraints. Bioorg Med Chem 28:0 (2020)  
Target
Name:
Beta-secretase 1
Synonyms:
ASP2 Aspartyl protease 2 BACE1 Beta-secretase (BACE) Beta-secretase 1 (BACE 1) Beta-secretase 1 (BACE1) Beta-site amyloid precursor protein cleaving enzyme 1 Memapsin-2 beta-Secretase (BACE-1) | beta-Secretase (BACE1)
Type:
Protein
Mol. Mass.:
55755.10
Organism:
Homo sapiens (Human)
Description:
P56817
Residue:
501
  
Inhibitor
Name:
BDBM50540168
Synonyms:
CHEMBL4644249
Type:
Small organic molecule
Emp. Form.:
C15H23N3O2S
Mol. Mass.:
309.427
SMILES:
[H][C@]1(C[C@H]1C(=O)NC[C@@H]1C[C@H]1C)[C@]12COC[C@@]1([H])CSC(N)=N2
: