Target
Beta-secretase 2
Ligand
BDBM50012647
Substrate
Meas. Tech.
ChEMBL_1980874 (CHEMBL4614136)
IC50
10±n/a nM
Citation
 Winneroski, LLErickson, JAGreen, SJLopez, JEStout, SLPorter, WJTimm, DEAudia, JEBarberis, MBeck, JPBoggs, LNBorders, ARBoyer, RDBrier, RAHembre, EJHendle, JGarcia-Losada, PMinguez, JMMathes, BMMay, PCMonk, SARankovic, ZShi, YWatson, BMYang, ZMergott, DJ Preparation and biological evaluation of BACE1 inhibitors: Leveraging trans-cyclopropyl moieties as ligand efficient conformational constraints. Bioorg Med Chem 28:0 (2020)  
Target
Name:
Beta-secretase 2
Synonyms:
AEPLC ASP1 Asp 1 Aspartyl protease 1 BACE2_HUMAN Beta-secretase (BACE) Beta-secretase 2 (BACE-2) Beta-site APP-cleaving enzyme 2 Memapsin-1 beta-Secretase (BACE-2)
Type:
Protein
Mol. Mass.:
56171.20
Organism:
Homo sapiens (Human)
Description:
Q9Y5Z0
Residue:
518
  
Inhibitor
Name:
BDBM50012647
Synonyms:
CHEMBL2396989
Type:
Small organic molecule
Emp. Form.:
C18H16F2N4O2S
Mol. Mass.:
390.407
SMILES:
[H][C@@]12COC[C@@]1(N=C(N)SC2)c1cc(NC(=O)c2ccc(F)cn2)ccc1F
: