Target
P2X purinoceptor 1
Ligand
BDBM50240455
Substrate
Meas. Tech.
ChEMBL_1981892 (CHEMBL4615154)
IC50
236±n/a nM
Citation
 Tian, MAbdelrahman, ABaqi, YFuentes, EAzazna, DSpanier, CDensborn, SHinz, SSchmid, RMüller, CE Discovery and Structure Relationships of Salicylanilide Derivatives as Potent, Non-acidic P2X1 Receptor Antagonists. J Med Chem 63:6164-6178 (2020)  
Target
Name:
P2X purinoceptor 1
Synonyms:
ATP receptor P2RX1_HUMAN Purinergic receptor | Purinergic, P2X
Type:
Enzyme Catalytic Domain
Mol. Mass.:
44992.65
Organism:
Homo sapiens (Human)
Description:
Purinergic, P2X 0 HUMAN::P51575
Residue:
399
  
Inhibitor
Name:
BDBM50240455
Synonyms:
CHEMBL1253351
Type:
Small organic molecule
Emp. Form.:
C41H24N6Na8O29S8
Mol. Mass.:
1505.09
SMILES:
[Na+].[Na+].[Na+].[Na+].[Na+].[Na+].[Na+].[Na+].[O-]S(=O)(=O)c1ccc(NC(=O)c2cc(NC(=O)Nc3cc(cc(c3)C(=O)Nc3ccc(cc3S([O-])(=O)=O)S([O-])(=O)=O)C(=O)Nc3ccc(cc3S([O-])(=O)=O)S([O-])(=O)=O)cc(c2)C(=O)Nc2ccc(cc2S([O-])(=O)=O)S([O-])(=O)=O)c(c1)S([O-])(=O)=O
: