Target
P2X purinoceptor 1
Ligand
BDBM50540439
Substrate
Meas. Tech.
ChEMBL_1981892 (CHEMBL4615154)
IC50
172±n/a nM
Citation
 Tian, MAbdelrahman, ABaqi, YFuentes, EAzazna, DSpanier, CDensborn, SHinz, SSchmid, RMüller, CE Discovery and Structure Relationships of Salicylanilide Derivatives as Potent, Non-acidic P2X1 Receptor Antagonists. J Med Chem 63:6164-6178 (2020)  
Target
Name:
P2X purinoceptor 1
Synonyms:
ATP receptor P2RX1_HUMAN Purinergic receptor | Purinergic, P2X
Type:
Enzyme Catalytic Domain
Mol. Mass.:
44992.65
Organism:
Homo sapiens (Human)
Description:
Purinergic, P2X 0 HUMAN::P51575
Residue:
399
  
Inhibitor
Name:
BDBM50540439
Synonyms:
CHEMBL2088009
Type:
Small organic molecule
Emp. Form.:
C13H9ClN2O4
Mol. Mass.:
292.675
SMILES:
Oc1ccc(Cl)cc1C(=O)Nc1cccc(c1)[N+]([O-])=O
: