Target
M-phase inducer phosphatase 2
Ligand
BDBM50096693
Substrate
Meas. Tech.
ChEMBL_48703 (CHEMBL659778)
Ki
36000±n/a nM
Citation
 Wipf, PAslan, DCSouthwick, ECLazo, JS Sulfonylated aminothiazoles as new small molecule inhibitors of protein phosphatases. Bioorg Med Chem Lett 11:313-7 (2001)  
Target
Name:
M-phase inducer phosphatase 2
Synonyms:
CDC25B Dual specificity phosphatase (CDC25B) M-phase inducer phosphatase 2 (CDC25B) | MPIP2_HUMAN
Type:
Protein
Mol. Mass.:
64985.27
Organism:
Homo sapiens (Human)
Description:
Residue:
580
  
Inhibitor
Name:
BDBM50096693
Synonyms:
(E)-2-Naphthalen-2-yl-ethenesulfonic acid (4,5-diphenyl-thiazol-2-yl)-amide | CHEMBL105872
Type:
Small organic molecule
Emp. Form.:
C27H20N2O2S2
Mol. Mass.:
468.59
SMILES:
O=S(=O)(Nc1nc(c(s1)-c1ccccc1)-c1ccccc1)\C=C\c1ccc2ccccc2c1
: