Target
Serine/threonine-protein kinase Sgk1
Ligand
BDBM50540597
Substrate
Meas. Tech.
ChEMBL_1982315 (CHEMBL4615577)
Ki
600±n/a nM
Citation
 Greco, CTaresco, VPearce, AKVasey, CESmith, SRahman, RAlexander, CCavanagh, RJMusumeci, FSchenone, S Development of Pyrazolo[3,4- ACS Med Chem Lett 11:657-663 (2020)  
Target
Name:
Serine/threonine-protein kinase Sgk1
Synonyms:
SGK SGK1_HUMAN Serine/threonine-protein kinase Sgk1 (SGK) Serum/glucocorticoid-regulated kinase 1 (SGK1)
Type:
Other Protein Type
Mol. Mass.:
48954.40
Organism:
Homo sapiens (Human)
Description:
Recombinant human SGK-1 enzyme produced in a baculovirus system.
Residue:
431
  
Inhibitor
Name:
BDBM50540597
Synonyms:
CHEMBL4638374
Type:
Small organic molecule
Emp. Form.:
C23H24N6O
Mol. Mass.:
400.4763
SMILES:
OCCNc1nc(NCCc2ccccc2)c2cnn(\C=C\c3ccccc3)c2n1
: