Target
Beta-glucuronidase
Ligand
BDBM163643
Substrate
Meas. Tech.
ChEMBL_1983556 (CHEMBL4616962)
IC50
6430±n/a nM
Citation
 Awolade, PCele, NKerru, NGummidi, LOluwakemi, ESingh, P Therapeutic significance of ?-glucuronidase activity and its inhibitors: A review. Eur J Med Chem 187:0 (2020)  
Target
Name:
Beta-glucuronidase
Synonyms:
β-Glucuronidase Beta-G1 GUSB | beta-Glucuronidase (β-glucuronidase)
Type:
Protein
Mol. Mass.:
74736.05
Organism:
Homo sapiens (Human)
Description:
Residue:
651
  
Inhibitor
Name:
BDBM163643
Synonyms:
2[4(2H1,3benzodioxol5ylmethyl)piperazin1yl]N(2,5dimethoxycyclohexyl)acetamide (Inh 8) | US9334288, 8
Type:
Small organic molecule
Emp. Form.:
C22H33N3O5
Mol. Mass.:
419.5145
SMILES:
COC1CCC(OC)C(C1)NC(=O)CN1CCN(Cc2ccc3OCOc3c2)CC1
: