Target
Retinoic acid receptor gamma
Ligand
BDBM50097824
Substrate
Meas. Tech.
ChEMBL_196172 (CHEMBL804945)
EC50
10±n/a nM
Citation
 Beard, RLKlein, ESStandeven, AMEscobar, MChandraratna, RA Phenylcyclohexene and phenylcyclohexadiene substituted compounds having retinoid antagonist activity. Bioorg Med Chem Lett 11:765-8 (2001)  
Target
Name:
Retinoic acid receptor gamma
Synonyms:
NR1B3 RAR-gamma RARG_HUMAN Retinoic acid receptor gamma | Retinoid receptor
Type:
PROTEIN
Mol. Mass.:
50345.43
Organism:
Homo sapiens (Human)
Description:
ChEMBL_1458016
Residue:
454
  
Inhibitor
Name:
BDBM50097824
Synonyms:
4-[(E)-4-(2,6,6-Trimethyl-cyclohex-1-enyl)-but-3-en-1-ynyl]-benzoic acid | CHEMBL151870
Type:
Small organic molecule
Emp. Form.:
C20H22O2
Mol. Mass.:
294.3875
SMILES:
CC1=C(\C=C\C#Cc2ccc(cc2)C(O)=O)C(C)(C)CCC1
: