Target
Retinoic acid receptor gamma
Ligand
BDBM50029774
Substrate
Meas. Tech.
ChEMBL_196316 (CHEMBL806259)
IC50
3±n/a nM
Citation
 Beard, RLKlein, ESStandeven, AMEscobar, MChandraratna, RA Phenylcyclohexene and phenylcyclohexadiene substituted compounds having retinoid antagonist activity. Bioorg Med Chem Lett 11:765-8 (2001)  
Target
Name:
Retinoic acid receptor gamma
Synonyms:
NR1B3 RAR-gamma RARG_HUMAN Retinoic acid receptor gamma | Retinoid receptor
Type:
PROTEIN
Mol. Mass.:
50345.43
Organism:
Homo sapiens (Human)
Description:
ChEMBL_1458016
Residue:
454
  
Inhibitor
Name:
BDBM50029774
Synonyms:
4-(5,5-Dimethyl-8-p-tolyl-5,6-dihydro-naphthalen-2-ylethynyl)-benzoic acid | CHEMBL358145
Type:
Small organic molecule
Emp. Form.:
C28H24O2
Mol. Mass.:
392.489
SMILES:
Cc1ccc(cc1)C1=CCC(C)(C)c2ccc(cc12)C#Cc1ccc(cc1)C(O)=O
: