Target
Retinoic acid receptor beta
Ligand
BDBM50097824
Substrate
Meas. Tech.
ChEMBL_195651 (CHEMBL796046)
EC50
7±n/a nM
Citation
 Beard, RLKlein, ESStandeven, AMEscobar, MChandraratna, RA Phenylcyclohexene and phenylcyclohexadiene substituted compounds having retinoid antagonist activity. Bioorg Med Chem Lett 11:765-8 (2001)  
Target
Name:
Retinoic acid receptor beta
Synonyms:
HAP NR1B2 RAR-beta RARB Retinoic acid receptor RXR-alpha/Retinoic acid receptor beta Retinoid receptor
Type:
PROTEIN
Mol. Mass.:
50498.70
Organism:
Homo sapiens (Human)
Description:
ChEMBL_1458015
Residue:
455
  
Inhibitor
Name:
BDBM50097824
Synonyms:
4-[(E)-4-(2,6,6-Trimethyl-cyclohex-1-enyl)-but-3-en-1-ynyl]-benzoic acid | CHEMBL151870
Type:
Small organic molecule
Emp. Form.:
C20H22O2
Mol. Mass.:
294.3875
SMILES:
CC1=C(\C=C\C#Cc2ccc(cc2)C(O)=O)C(C)(C)CCC1
: