Target
Retinoic acid receptor alpha
Ligand
BDBM50097820
Substrate
Meas. Tech.
ChEMBL_195324 (CHEMBL799719)
Kd
129±n/a nM
Citation
 Beard, RLKlein, ESStandeven, AMEscobar, MChandraratna, RA Phenylcyclohexene and phenylcyclohexadiene substituted compounds having retinoid antagonist activity. Bioorg Med Chem Lett 11:765-8 (2001)  
Target
Name:
Retinoic acid receptor alpha
Synonyms:
NR1B1 RAR-alpha RARA_HUMAN Retinoic acid receptor alpha/Retinoid X receptor alpha Retinoid receptor
Type:
PROTEIN
Mol. Mass.:
50778.87
Organism:
Homo sapiens (Human)
Description:
ChEMBL_1466191
Residue:
462
  
Inhibitor
Name:
BDBM50097820
Synonyms:
4-[(E)-4-(3,3-Dimethyl-6-p-tolyl-cyclohexa-1,5-dienyl)-but-3-en-1-ynyl]-benzoic acid | CHEMBL350485
Type:
Small organic molecule
Emp. Form.:
C26H24O2
Mol. Mass.:
368.4676
SMILES:
Cc1ccc(cc1)C1=CCC(C)(C)C=C1\C=C\C#Cc1ccc(cc1)C(O)=O
: