Target
Retinoic acid receptor beta
Ligand
BDBM50097825
Substrate
Meas. Tech.
ChEMBL_195813 (CHEMBL807724)
Kd
87±n/a nM
Citation
 Beard, RLKlein, ESStandeven, AMEscobar, MChandraratna, RA Phenylcyclohexene and phenylcyclohexadiene substituted compounds having retinoid antagonist activity. Bioorg Med Chem Lett 11:765-8 (2001)  
Target
Name:
Retinoic acid receptor beta
Synonyms:
HAP NR1B2 RAR-beta RARB Retinoic acid receptor RXR-alpha/Retinoic acid receptor beta Retinoid receptor
Type:
PROTEIN
Mol. Mass.:
50498.70
Organism:
Homo sapiens (Human)
Description:
ChEMBL_1458015
Residue:
455
  
Inhibitor
Name:
BDBM50097825
Synonyms:
4-{(E)-4-[6-(4-tert-Butyl-phenyl)-3,3-dimethyl-cyclohexa-1,5-dienyl]-but-3-en-1-ynyl}-benzoic acid | CHEMBL164176
Type:
Small organic molecule
Emp. Form.:
C29H30O2
Mol. Mass.:
410.5473
SMILES:
CC(C)(C)c1ccc(cc1)C1=CCC(C)(C)C=C1\C=C\C#Cc1ccc(cc1)C(O)=O
: