Target
Retinoic acid receptor gamma
Ligand
BDBM50097825
Substrate
Meas. Tech.
ChEBML_196324
Kd
>1000±n/a nM
Citation
 Beard, RLKlein, ESStandeven, AMEscobar, MChandraratna, RA Phenylcyclohexene and phenylcyclohexadiene substituted compounds having retinoid antagonist activity. Bioorg Med Chem Lett 11:765-8 (2001)  
Target
Name:
Retinoic acid receptor gamma
Synonyms:
NR1B3 RAR-gamma RARG_HUMAN Retinoic acid receptor gamma | Retinoid receptor
Type:
PROTEIN
Mol. Mass.:
50345.43
Organism:
Homo sapiens (Human)
Description:
ChEMBL_1458016
Residue:
454
  
Inhibitor
Name:
BDBM50097825
Synonyms:
4-{(E)-4-[6-(4-tert-Butyl-phenyl)-3,3-dimethyl-cyclohexa-1,5-dienyl]-but-3-en-1-ynyl}-benzoic acid | CHEMBL164176
Type:
Small organic molecule
Emp. Form.:
C29H30O2
Mol. Mass.:
410.5473
SMILES:
CC(C)(C)c1ccc(cc1)C1=CCC(C)(C)C=C1\C=C\C#Cc1ccc(cc1)C(O)=O
: