Target
5-hydroxytryptamine receptor 2C
Ligand
BDBM50094674
Substrate
Meas. Tech.
ChEBML_2818
Ki
55±n/a nM
Citation
 Laban, UKurrasch-Orbaugh, DMarona-Lewicka, DNichols, DE A novel fluorinated tryptamine with highly potent serotonin 5-HT1A receptor agonist properties. Bioorg Med Chem Lett 11:793-5 (2001)  
Target
Name:
5-hydroxytryptamine receptor 2C
Synonyms:
5-HT2C 5-hydroxytryptamine receptor 2C (5HT2c) 5ht1c Htr2c Serotonin receptor 2a and 2c (5HT2A and 5HT2C)
Type:
Enzyme
Mol. Mass.:
51935.10
Organism:
Rattus norvegicus (Rat)
Description:
P08909
Residue:
460
  
Inhibitor
Name:
BDBM50094674
Synonyms:
CHEMBL142862 | [2-(4-Fluoro-5-methoxy-1H-indol-3-yl)-ethyl]-dimethyl-amine
Type:
Small organic molecule
Emp. Form.:
C13H17FN2O
Mol. Mass.:
236.2853
SMILES:
COc1ccc2[nH]cc(CCN(C)C)c2c1F
: