Target
5-hydroxytryptamine receptor 1A
Ligand
BDBM50094674
Substrate
Meas. Tech.
ChEBML_897
Ki
0.230000±n/a nM
Citation
 Laban, UKurrasch-Orbaugh, DMarona-Lewicka, DNichols, DE A novel fluorinated tryptamine with highly potent serotonin 5-HT1A receptor agonist properties. Bioorg Med Chem Lett 11:793-5 (2001)  
Target
Name:
5-hydroxytryptamine receptor 1A
Synonyms:
5-HT-1A 5-hydroxytryptamine receptor 1A (5-HT-1A) ADRB2RL1 Dopamine D2 receptor and serotonin 1a receptor HTR1A | Serotonin receptor 1A
Type:
Mol. Mass.:
46122.49
Organism:
Homo sapiens (Human)
Description:
Residue:
422
  
Inhibitor
Name:
BDBM50094674
Synonyms:
CHEMBL142862 | [2-(4-Fluoro-5-methoxy-1H-indol-3-yl)-ethyl]-dimethyl-amine
Type:
Small organic molecule
Emp. Form.:
C13H17FN2O
Mol. Mass.:
236.2853
SMILES:
COc1ccc2[nH]cc(CCN(C)C)c2c1F
: