Target
5-hydroxytryptamine receptor 2A
Ligand
BDBM50094674
Substrate
Meas. Tech.
ChEBML_2612
Ki
122±n/a nM
Citation
 Laban, UKurrasch-Orbaugh, DMarona-Lewicka, DNichols, DE A novel fluorinated tryptamine with highly potent serotonin 5-HT1A receptor agonist properties. Bioorg Med Chem Lett 11:793-5 (2001)  
Target
Name:
5-hydroxytryptamine receptor 2A
Synonyms:
5-HT-2A 5-HT2A 5-hydroxytryptamine receptor 2A (5HT2A) Htr2 Serotonin Receptor 2A
Type:
G Protein-Coupled Receptor (GPCR)
Mol. Mass.:
52852.05
Organism:
Rattus norvegicus (rat)
Description:
Rat cortex membranes 5-HT2A receptors.
Residue:
471
  
Inhibitor
Name:
BDBM50094674
Synonyms:
CHEMBL142862 | [2-(4-Fluoro-5-methoxy-1H-indol-3-yl)-ethyl]-dimethyl-amine
Type:
Small organic molecule
Emp. Form.:
C13H17FN2O
Mol. Mass.:
236.2853
SMILES:
COc1ccc2[nH]cc(CCN(C)C)c2c1F
: