Target
Gonadotropin-releasing hormone receptor
Ligand
BDBM50098391
Substrate
Meas. Tech.
ChEMBL_71442 (CHEMBL685314)
IC50
0.5±n/a nM
Citation
 DeVita, RJWalsh, TFYoung, JRJiang, JUjjainwalla, FToupence, RBParikh, MHuang, SXFair, JAGoulet, MTWyvratt, MJLo, JLRen, NYudkovitz, JBYang, YTCheng, KCui, JMount, GRohrer, SPSchaeffer, JMRhodes, LDrisko, JEMcGowan, EMacIntyre, DEVincent, SCarlin, JRCameron, JSmith, RG A potent, nonpeptidyl 1H-quinolone antagonist for the gonadotropin-releasing hormone receptor. J Med Chem 44:917-22 (2001)  
Target
Name:
Gonadotropin-releasing hormone receptor
Synonyms:
GNRHR GRHR GnRH-R Gonadotropin-releasing hormone receptor | Gonadotropin-releasing hormone receptor (GnRH)
Type:
Enzyme
Mol. Mass.:
37749.45
Organism:
Homo sapiens (Human)
Description:
P30968
Residue:
328
  
Inhibitor
Name:
BDBM50098391
Synonyms:
(S)-4-(2-(azetidin-2-yl)ethoxy)-7-chloro-2-oxo-N-(pyrimidin-4-yl)-3-(3,4,5-trimethylphenyl)-1,2-dihydroquinoline-6-carboxamide 4-(2-Azetidin-2-yl-ethoxy)-7-chloro-2-oxo-3-(3,4,5-trimethyl-phenyl)-1,2-dihydro-quinoline-6-carboxylic acid pyrimidin-4-ylamide | CHEMBL120432
Type:
Small organic molecule
Emp. Form.:
C28H28ClN5O3
Mol. Mass.:
518.007
SMILES:
Cc1cc(cc(C)c1C)-c1c(OCC[C@@H]2CCN2)c2cc(C(=O)Nc3ccncn3)c(Cl)cc2[nH]c1=O
: